{"text_format":"1","workbook":"xlsx","n_sheets":8,"sheets":["Output","Input","Home","Company","Sentiment","Operations","Income","Workforce"],"not_rendered":{"charts":0,"images":5,"macros":1,"external_links":0,"defined_names":0,"comments":0,"pivot_tables":0},"unopened":[],"bounds":{"document_bytes":16777216,"sheet_cells":100000,"rows_first":2000,"rows_last":500,"rows_between":2000,"halvings":0,"cell_chars":16384,"cell_head_chars":4096},"cells_cut":0,"cells_raw":0,"read":"whole","date_system":"1900"}

{"sheet":"Output","index":0,"n_rows":161,"n_cols":4,"rows_kept":161,"cut":false,"hidden":true,"merged":[]}
["Question","Response"]
["Year",{"$f":"+Input!C3","v":2025}]
["Company Name",{"$f":"+Company!N14","v":"Enter company name here"}]
["Address",{"$f":"+Company!N15","v":"Enter address here"}]
["City",{"$f":"+Company!N16","v":"Enter city here"}]
["State/Province",{"$f":"+Company!N17","v":"Enter state / province here"}]
["Postal Code",{"$f":"+Company!N18","v":"Enter postal code here"}]
["Country",1]
["Contact",{"$f":"+Company!N22","v":"Enter contact name here"}]
["Contact Email",{"$f":"+Company!N23","v":"Enter contact email here"}]
["Contact Role",{"$f":"+Company!N24","v":"Enter contact role here"}]
["Currency Code",1]
["Currency Name",{"$f":"+VLOOKUP(B12,Input!$B$12:$C$17,2,FALSE)","v":"* Select *"}]
["Currency Other",{"$f":"+Company!S26","v":"If 'other' enter currency here"}]
["FTEs",{"$f":"+Company!N28","v":"Enter number of FTE employees here"}]
["PY Revenue",{"$f":"+Company!N31","v":"Enter actual revenue here"}]
["CY Revenue",{"$f":"+Company!N32","v":"Enter estimated revenue here"}]
["Years In Business",{"$f":"+Company!N34","v":"Enter years in business here"}]
["Market Segment Code",1]
["Market Segment Name",{"$f":"+VLOOKUP(B19,Input!$F$12:$G$31,2,FALSE)","v":"* Select *"}]
{"$rows_left_out":142}
{"sheet":"Input","index":1,"n_rows":33,"n_cols":22,"rows_kept":33,"cut":false,"hidden":true,"merged":[]}
[]
[null,"Version","Version 2025.1.2"]
[null,"CY",2025]
[null,"PY",2024]
[null,"Due","*** Your submission must be received by May 1, 2025 ***"]
[null,"Results","Results will be emailed to you by June 15, 2025."]
[]
[]
[]
[]
[null,"Survey Currency",null,null,null,"Primary Source Of Revenue",null,null,null,"INNERGY Customer",null,null,"Overall Conditions",null,"Next 6",null,"Cash Flow",null,"Next 6",null,"Engineering Software"]
[null,1,"* Select *",null,null,1,"* Select *",null,null,1,"* Select *",null,1,"* Select *",null,null,1,"* Select *",null,null,1,"* Select *"]
[null,{"$f":"+B12+1","v":2},"Australian Dollar (AUD)",null,null,{"$f":"+F12+1","v":2},"Architectural Doors",null,null,{"$f":"+J12+1","v":2},"Yes",null,2,"Improve",null,null,2,"Improve",null,null,2,"Not Satisfied"]
[null,{"$f":"+B13+1","v":3},"Canadian Dollar (CAD)",null,null,{"$f":"+F13+1","v":3},"Closets",null,null,{"$f":"+J13+1","v":3},"No",null,3,"Stay The Same",null,null,3,"Stay The Same",null,null,3,"Somewhat Satisfied"]
[null,{"$f":"+B14+1","v":4},"New Zealand Dollar (NZD)",null,null,4,"Commercial Architectural Millwork",null,null,null,null,null,4,"Decline",null,null,4,"Decline",null,null,4,"Satisfied"]
[null,{"$f":"+B15+1","v":5},"United States Dollar (USD)",null,null,5,"Custom Windows & Restoration",null,null,null,null,null,null,null,null,null,null,null,null,null,5,"Very Satisifed"]
[null,{"$f":"+B16+1","v":6},"Other",null,null,6,"High-End Residential",null,null,"INNERGY Customer Years",null,null,"Overall Conditions",null,"Last 6",null,"Cash Flow",null,"Last 6"]
[null,null,null,null,null,7,"Installation Firm",null,null,1,"* Select *",null,1,"* Select *",null,null,1,"* Select *",null,null,"Improvement Topics (all)"]
[null,null,null,null,null,8,"Mass Production Residential",null,null,{"$f":"+J18+1","v":2},"Less Than 1 Year",null,2,"Improved",null,null,2,"Improved",null,null,1,"* Select *"]
[null,"Country Location",null,null,null,9,"Mixed Commercial / Residential",null,null,{"$f":"+J19+1","v":3},"1 - 2 Years",null,3,"Stayed The Same",null,null,3,"Stayed The Same",null,null,2,"Not Important"]
{"$rows_left_out":14}
{"sheet":"Home","index":2,"n_rows":33,"n_cols":25,"rows_kept":33,"cut":false,"hidden":false,"merged":[[13,17,13,20],[32,7,32,19]]}
[]
[null,null,null,null,null,null,null,null,null,null,null,null,null,null,null,null,null,null,null,null,null,null,null,null,{"$f":"+Input!$C$2","v":"Version 2025.1.2"}]
[null,null," ",null,null,null,null,null,null,null,null,null,null,null,null,null,null,null,null,null,null,null,null,null," "]
[null,null," ",null,null,null,null,null,null,null,null,null,null,{"$f":"Input!$C$3 & \" INNERGY Industry Benchmarking Tool (IIBT)\"","v":"2025 INNERGY Industry Benchmarking Tool (IIBT)"},null,null,null,null,null,null,null,null,null,null," "]
[null,null," ",null,null,null,null,null,null,null,null,null,null,null,null,null,null,null,null,null,null,null,null,null," "]
[]
[null,null," ",null,null,null,null,null,null,null,null,null,null,null,null,null,null,null,null,null,null,null,null,null," "]
[]
[null,null," "," "," "," "," "," "," "," "," "," "," "," "," "," "," "," "," "," "," "," "," "," "," "]
[null,null," ",null,null,null,null,null,null,null,null,null,null,null,null,null,null,null,null,null,null,null,null,null," "]
[]
[null,null,null,null,null,null,null,"1.  You must use a Microsoft Windows machine to complete this survey.  Do NOT use an Apple MAC."]
[]
[null,null,null,null,null,null,null,"2.  If you see a 'Security Risk' warning, please enable macros (solely used for navigation).",null,null,null,null,null,null,null,null,null,"How Do I Enable Macros?"]
[]
[]
[]
[null,null,null,null,null,null,null,"3.  If you see a 'Read-Only' warning, please click the 'Edit Workbook' button."]
[]
[]
{"$rows_left_out":14}
{"sheet":"Company","index":3,"n_rows":51,"n_cols":25,"rows_kept":51,"cut":false,"hidden":false,"merged":[[18,18,18,21],[16,13,16,17],[21,13,21,17],[13,13,13,17],[14,13,14,17],[15,13,15,17],[17,13,17,17],[46,7,46,19],[35,18,35,21],[22,13,22,17],[23,13,23,17],[27,13,27,17],[30,13,30,17],[31,13,31,17],[33,13,33,17],[25,18,25,21]]}
[]
[null,null,null,null,null,null,null,null,null,null,null,null,null,null,null,null,null,null,null,null,null,null,null,null,{"$f":"+Input!$C$2","v":"Version 2025.1.2"}]
[null,null," ",null,null,null,null,null,null,null,null,null,null,null,null,null,null,null,null,null,null,null,null,null," "]
[null,null," ",null,null,null,null,null,null,null,null,null,null,{"$f":"+Home!$N$4","v":"2025 INNERGY Industry Benchmarking Tool (IIBT)"},null,null,null,null,null,null,null,null,null,null," "]
[null,null," ",null,null,null,null,null,null,null,null,null,null,null,null,null,null,null,null,null,null,null,null,null," "]
[]
[null,null," ",null,null,null,null,null,null,null,null,null,null,null,null,null,null,null,null,null,null,null,null,null," "]
[]
[null,null," "," "," "," "," "," "," "," "," "," "," "," ",null," "," "," "," "," "," "," "," "," "," "]
[null,null," ",null,null,null,null,null,null,null,null,null,null,null,null,null,null,null,null,null,null,null,null,null," "]
[null,null,null,"Please tell us about your company (9 questions)."]
[null,null," ",null,null,null,null,null,null,null,null,null,null,null,null,null,null,null,null,null,null,null,null,null," "]
[null,null," ",1,"Where is your primary business location?",null,null,null,null,null,null,null,null,null,null,null,null,null," "," "," "," "," "," "," "]
[null,null,null,null,null,"Company Name",null,null,null,null,null,null,null,"Enter company name here",null,null,null,null," "," "," "," "," "," "]
[null,null," ",null,null,"Address",null,null,null,null,null,null,null,"Enter address here",null,null,null,null," "," "," "," "," "," "," "]
[null,null,null,null,null,"City",null,null,null,null,null,null,null,"Enter city here",null,null,null,null," "]
[null,null,null,null,null,"State / Province",null,null,null,null,null,null,null,"Enter state / province here",null,null,null,null," "," "," "," "," "," "]
[null,null,null,null,null,"Postal Code",null,null,null,null,null,null,null,"Enter postal code here",null,null,null,null," "]
[null,null,null,null,null,"Country",null,null,null,null,null,null,null,null,null,null,null,null,"If 'other' enter country here",null,null,null," "," "]
[]
{"$rows_left_out":32}
{"sheet":"Sentiment","index":4,"n_rows":34,"n_cols":25,"rows_kept":34,"cut":false,"hidden":false,"merged":[[33,7,33,19]]}
[]
[null,null,null,null,null,null,null,null,null,null,null,null,null,null,null,null,null,null,null,null,null,null,null,null,{"$f":"+Input!$C$2","v":"Version 2025.1.2"}]
[null,null," ",null,null,null,null,null,null,null,null,null,null,null,null,null,null,null,null,null,null,null,null,null," "]
[null,null," ",null,null,null,null,null,null,null,null,null,null,{"$f":"+Home!$N$4","v":"2025 INNERGY Industry Benchmarking Tool (IIBT)"},null,null,null,null,null,null,null,null,null,null," "]
[null,null," ",null,null,null,null,null,null,null,null,null,null,null,null,null,null,null,null,null,null,null,null,null," "]
[]
[null,null," ",null,null,null,null,null,null,null,null,null,null,null,null,null,null,null,null,null,null,null,null,null," "]
[]
[null,null," "," "," "," "," "," "," "," "," "," "," "," "," "," "," "," "," "," "," "," "," "," "," "]
[null,null," ",null,null,null,null,null,null,null,null,null,null,null,null,null,null,null,null,null,null,null,null,null," "]
[null,null,null,"What is your CEO's view of the economy and business conditions (4 questions)?"]
[]
[null,null," ",1,"Economic Conditions",null,null,null,null,null,null,null,null,null,null,null,null,null,null,null,null,null,null,null," "]
[null,null,null,null,"We believe economic conditions will _____ over the next 6 months"]
[null,null,null,null,"Overall economic conditions have _____ over the past 6 months"]
[]
[null,null,null,2,"Sales Pipeline"]
[null,null,null,null,"We believe our sales pipeline will _____ over the next 6 months"]
[null,null,null,null,"Our sales pipeline _____ over the past 6 months"]
[]
{"$rows_left_out":15}
{"sheet":"Operations","index":5,"n_rows":73,"n_cols":25,"rows_kept":73,"cut":false,"hidden":false,"merged":[[16,10,16,11],[14,10,14,11],[12,10,12,11],[20,10,20,11],[22,10,22,11],[72,7,72,19],[35,11,35,17],[58,12,58,13],[30,20,30,22],[18,10,18,11]]}
[]
[null,null,null,null,null,null,null,null,null,null,null,null,null,null,null,null,null,null,null,null,null,null,null,null,{"$f":"+Input!$C$2","v":"Version 2025.1.2"}]
[null,null," ",null,null,null,null,null,null,null,null,null,null,null,null,null,null,null,null,null,null,null,null,null," "]
[null,null," ",null,null,null,null,null,null,null,null,null,null,{"$f":"+Home!$N$4","v":"2025 INNERGY Industry Benchmarking Tool (IIBT)"},null,null,null,null,null,null,null,null,null,null," "]
[null,null," ",null,null,null,null,null,null,null,null,null,null,null,null,null,null,null,null,null,null,null,null,null," "]
[]
[null,null," ",null,null,null,null,null,null,null,null,null,null,null,null,null,null,null,null,null,null,null,null,null," "]
[]
[null,null," "," "," "," "," "," "," "," "," "," "," "," "," "," "," "," "," "," "," "," "," "," "," "]
[null,null," ",null,null,null,null,null,null,null,null,null,null,null,null,null,null,null,null,null,null,null,null," "," "]
[null,null,null,"Please tell us about your current operations (12 questions).",null,null,null,null,null,null,null,null,null,"Definitions (Tip:  click the first word and press F2 button to see full text)",null,null,null,null,null,null,null,null,null," "]
[null,null," ",null,null,null,null,null,null,null,null,null,null,null,null,null,null,null,null,null,null,null,null," "," "]
[null,null," ",1,"What is your bid success rate?",null,null,null,null,null,"%",null,null,"Over the past 12 months, estimated $ value of proposals which were successful / $ value of proposals submitted.",null,null,null,null,null,null,null,null,null," "," "]
[null,null,null,null,null,null,null,null,null,null,null,null,null,null,null,null,null,null,null,null,null,null,null," "]
[null,null," ",{"$f":"+D13+1","v":2},"What is your current backlog?",null,null,null,null,null,"$",null,null,"Backlog = $ of contracted work that has yet to be invoiced.  For the purposes of this survey, backlog is the value of sales orders that have been 'won' but have not been invoiced including those projects that are in-progess but you have not recognized revenue.  We will convert this to months of backlog automatically as part of the aggregated results. ",null,null,null,null,null,null,null,null,null," "," "]
[null,null,null,null,null,null,null,null,null,null,null,null,null,null,null,null,null,null,null,null,null,null,null," "]
[null,null,null,{"$f":"+D15+1","v":3},"What is the amount you currently have in AR?",null,null,null,null,null,"$",null,null,"$ of invoices that you have not yet collected at the time you completed this survey.",null,null,null,null,null,null,null,null,null," "]
[null,null,null,null,null,null,null,null,null,null,null,null,null,null,null,null,null,null,null,null,null,null,null," "]
[null,null,null,{"$f":"+D17+1","v":4},"What is the amount you currently have in AP?",null,null,null,null,null,"$",null,null,"$ of bills you owe that you have not yet paid at the time you completed this survey.",null,null,null,null,null,null,null,null,null," "]
[null,null,null,null,null,null,null,null,null,null,null,null,null,null,null,null,null,null,null,null,null,null,null," "]
{"$rows_left_out":54}
{"sheet":"Income","index":6,"n_rows":95,"n_cols":25,"rows_kept":95,"cut":false,"hidden":false,"merged":[[54,8,54,9],[55,7,56,9],[94,7,94,19]]}
[]
[null,null,null,null,null,null,null,null,null,null,null,null,null,null,null,null,null,null,null,null,null,null,null,null,{"$f":"+Input!$C$2","v":"Version 2025.1.2"}]
[null,null," ",null,null,null,null,null,null,null,null,null,null,null,null,null,null,null,null,null,null,null,null,null," "]
[null,null," ",null,null,null,null,null,null,null,null,null,null,{"$f":"+Home!$N$4","v":"2025 INNERGY Industry Benchmarking Tool (IIBT)"},null,null,null,null,null,null,null,null,null,null," "]
[null,null," ",null,null,null,null,null,null,null,null,null,null,null,null,null,null,null,null,null,null,null,null,null," "]
[]
[null,null," ",null,null,null,null,null,null,null,null,null,null,null,null,null,null,null,null,null,null,null,null,null," "]
[]
[null,null," "," "," "," "," "," "," "," "," "," "," "," "," "," "," "," "," "," "," "," "," "," "," "]
[null,null," ",null,null,null,null,null,null,null,null,null,null,null,null,null,null,null,null,null,null,null,null,null," "]
[null,null,null,"Please tell us about your most recent income statement (12 input fields in gray)."]
[]
[null,null,null,null,"Enter your annual revenue and expense items in the gray cells (ignore all accounting provisions for interest income(expense), federal/state income taxes, deferral and amoritization)."]
[null,null,null,null,"See the definitions to the right of each item (Tip:  click the first word and press F2 button to see full text)."]
[null,null,null,null,"See the Position Chart at the bottom of this page to determine where to put labor costs for Lines 8, 9, 16 and 17."]
[null,null," ",null,"All labor costs should be fully loaded labor cost (base compensation, bonuses, state and federal payroll taxes and the cost of all employee benefits).",null,null,null,null,null,null,null,null,null,null,null,null,null,null,null,null,null,null,null," "]
[null,null,null,null,"Tip:  pro-rate your overall employee benefits costs if you do not break employee benefits costs out out by position (use the labor costs you entered on lines 8, 9, 16 and 17)."]
[]
[null,null,null,null,null,null,null,null,null,null,null,null,null,null,null,null,null,null,null,null,null,null,null," "]
[null,null,null,null,"Revenue",null,null,null,null,null,"Revenue for the last full fiscal year, generally January 1 - December 31.",null,null,null,null,null,null,null,null,null,null,null,null," "]
{"$rows_left_out":76}
{"sheet":"Workforce","index":7,"n_rows":50,"n_cols":25,"rows_kept":50,"cut":false,"hidden":false,"merged":[[49,7,49,19],[38,10,38,22],[40,12,40,13],[33,10,33,11],[29,11,29,17],[31,13,31,22]]}
[]
[null,null,null,null,null,null,null,null,null,null,null,null,null,null,null,null,null,null,null,null,null,null,null,null,{"$f":"+Input!$C$2","v":"Version 2025.1.2"}]
[null,null," ",null,null,null,null,null,null,null,null,null,null,null,null,null,null,null,null,null,null,null,null,null," "]
[null,null," ",null,null,null,null,null,null,null,null,null,null,{"$f":"+Home!$N$4","v":"2025 INNERGY Industry Benchmarking Tool (IIBT)"},null,null,null,null,null,null,null,null,null,null," "]
[null,null," ",null,null,null,null,null,null,null,null,null,null,null,null,null,null,null,null,null,null,null,null,null," "]
[]
[null,null," ",null,null,null,null,null,null,null,null,null,null,null,null,null,null,null,null,null,null,null,null,null," "]
[]
[null,null," "," "," "," "," "," "," "," "," "," "," "," "," "," "," "," "," "," "," "," "," "," "," "]
[null,null," ",null,null,null,null,null,null,null,null,null,null,null,null,null,null,null,null,null,null,null,null,null," "]
[null,null,null,"Please tell us about your workforce (6 questions)."]
[null,null," ",null,null,null,null,null,null,null,null,null,null,null,null,null,null,null,null,null,null,null,null,null," "]
[null,null,null,1,"How many employees do you have in these roles?  How much do you pay them, on average, per hour?",null,null,null,null,null,null,null,null,null,null,null,null,null,null,null,null,null,null," "]
[null,null,null,null,null,null,null,null,null,null,null,null,null,null,null,null,null,null,null,null,null,null,null," "]
[]
[null,null,null,null,null,null,null,null,null,null,null,null,null,"Definitions (Tip:  click the first word and press F2 button to see full text)",null,null,null,null,null,null,null,null,null," "]
[]
[null,null,null,null,"Estimator",null,null,null,null,0,null,0,null,"Responsible for selecting which jobs to bid, job costing, preparing take-offs and \npricing estimates, may be involved in sourcing / selling / closing some sales.",null,null,null,null,null,null,null,null,null," "]
[null,null,null,null,"Engineer / Drafter",null,null,null,null,0,null,0,null,"Responsible for shop drawing submittals, bill of materials, material optimizations, production engineering. Works closely with estimators to determine customer requirements and supporting project managers with changes and add-ons.",null,null,null,null,null,null,null,null,null," "]
[null,null,null,null,"Project Manager",null,null,null,null,0,null,0,null,"Responsible for coordinating all aspects of the job including scheduling, budget, production, and installation (if applicable) once the bid has been awarded.",null,null,null,null,null,null,null,null,null," "]
{"$rows_left_out":30}